{"text_format":"1","workbook":"xlsx","n_sheets":24,"sheets":["Cover","Instructions","SUPPLIER WIKI ","Scoring_Summary","Draft","A-Basic Info. ","B-Quality Management 1","C-Quality Management 2","D-Quality Management 3","E-Customer Service 1","F-Customer Service 2","G-Human Resources","H-Environmental","I-Health & Safety","J-Regulatory Compliance","Arkusz1","K-Procurement","L-Engineering","M-Distributor","N-Generic, Business","O-Special Process Documentation","P-Other Documents","Q-Contractor","R-Service"],"not_rendered":{"charts":13,"images":2,"macros":1,"external_links":1,"defined_names":75,"comments":0,"pivot_tables":0},"unopened":[],"bounds":{"document_bytes":16777216,"sheet_cells":100000,"rows_first":2000,"rows_last":500,"rows_between":2000,"halvings":0,"cell_chars":16384,"cell_head_chars":4096},"cells_cut":0,"cells_raw":0,"read":"whole","date_system":"1900"}

{"sheet":"Cover","index":0,"n_rows":39,"n_cols":8,"rows_kept":39,"cut":false,"hidden":false,"merged":[[35,7,35,8],[37,7,37,8],[34,3,34,5],[34,7,34,8],[36,3,36,5],[36,7,36,8],[38,3,38,5],[38,7,38,8],[1,2,1,6],[2,2,2,6],[3,2,3,6],[1,7,1,8],[2,7,3,8],[31,7,31,8],[22,1,25,8],[18,0,18,8],[27,1,27,8],[26,1,26,8],[31,1,31,2],[28,1,29,8],[35,3,35,5],[37,3,37,5]]}
[]
["EnerSys ",null,"GLOBAL QUALITY MANAGEMENT SYSTEM",null,null,null,null,"PROPIETARY DOCUMENT"]
["DOCUMENT NUMBER:",null,"QMS-GFORM-004",null,null,null,null,"REVISION: AD                       SUPERCEDES: AC             CHANGE NO: ECO 1002439"]
["DOCUMENT TITLE:",null,"SUPPLIER RISK ASSESSMENT QUESTIONNARIE"]
[]
[]
[]
[]
[]
[]
{"$rows_left_out":30}
{"sheet":"Instructions","index":1,"n_rows":26,"n_cols":2,"rows_kept":26,"cut":false,"hidden":false,"merged":[[4,1,5,1]]}
[null,"Instructions for Completing the Supplier Quality Survey"]
[]
[1,"Please complete the form found in Sheet A-Basic Info. (first yellow tab) of this workbook. Provide as much detail as possible."]
[]
[2,"Based on the various topics and statements listed in sheets A through R, in the boxes provided, rate your company.\nNote, all answers should be numeric and should not exceed the maximum allowable rating for any specific statement. Maximum scores are listed to the right of each answer box."]
[]
[3,"As you complete the survey, the graphs on the sheet labeled Scoring_Summary  will automatically update."]
[4,"Please select the Type of Supplier in the Scoring_Summary sheet. The categories that are valid for the given type of Supplier will be highlighted in yellow. Complete all visible yellow sheets. The sheets that the Supplier does not need to complete will be white."]
[5,"Once completed, please email the form and any corroborating information to requester."]
[6,"If you have any questions or comments regarding the survey, please feel free to contact requester."]
{"$rows_left_out":17}
{"sheet":"SUPPLIER WIKI ","index":2,"n_rows":42,"n_cols":3,"rows_kept":42,"cut":false,"hidden":false,"merged":[]}
["Section ","Acronym","Description "]
["A","H&S","Health & Safety "]
["A,H,P","ISO","International Organization for Standardization"]
["A,N","TL","Telecom Quality Management system"]
["A,P","C-TPAT","Customs-Trade Partnership Against Terrorism "]
["A","SVI","Status Verification Interface."]
["B,J","ROHS","Restriction of Hazardous Substances Directive"]
["B,J","REACH","Registration, Evaluation, Authorization and Restriction of Chemicals is a European Union regulation"]
["C","KPI","Key Performance indicators"]
["D","DFMEA","Design Failure modes and effects analysis"]
{"$rows_left_out":33}
{"sheet":"Scoring_Summary","index":3,"n_rows":78,"n_cols":26,"rows_kept":78,"cut":false,"hidden":false,"merged":[[78,19,78,22],[47,12,47,15],[48,12,48,15],[49,12,49,15],[52,11,52,13],[53,12,53,15],[54,12,54,15],[57,11,57,13],[58,12,58,14],[46,11,46,13],[66,11,66,13],[18,12,18,14],[24,12,24,15],[27,11,27,13],[28,12,28,14],[32,11,32,13],[33,12,33,14],[41,11,41,13],[38,12,38,14],[37,11,37,13],[0,10,0,23],[4,11,4,13],[5,12,5,14],[6,12,6,13],[7,12,7,13],[2,10,2,23],[8,12,8,14],[14,11,14,13],[15,12,15,14],[16,12,16,14],[17,12,17,14],[9,12,9,14],[10,12,10,14],[11,12,11,15],[25,0,25,5],[2,7,2,9],[18,0,18,5],[4,2,4,8],[15,0,15,5],[5,2,5,8],[13,0,13,5],[17,0,17,5],[11,0,11,5],[6,7,6,9],[16,0,16,5],[12,0,12,5],[2,0,2,1],[2,2,2,5],[3,0,3,1],[0,3,0,9],[1,8,1,9],[24,0,24,5],[7,2,7,5],[7,7,7,9],[1,0,1,7],[3,2,3,8],[6,0,6,1],[6,2,6,5],[9,6,10,6],[9,7,10,7],[9,8,10,8],[9,9,10,9],[14,0,14,5],[9,0,10,5]]}
[null,null,null,"Supplier/Contractor Scoring Summary",null,null,null,null,null,null,"Approved → 80% - 100%\nConditional Approved → 60% - 79%\nNot - Approved → <59%"]
["Type of Supplier:",null,null,null,null,null,null,null,"MANUFACTURER",null,"After selecting the supplier type, complete required categories in the yellow sheets below↓"]
["Supplier Name: ",null,{"$f":"'A-Basic Info. '!C3","v":0},null,null,null,"Date: ",{"$f":"'A-Basic Info. '!H9","v":"00:00:00"},null,null,"Supplier Score by Category"]
[null,null,{"$f":"'A-Basic Info. '!C4","v":0},null,null,null,null,null,null,null,null,null,null,null,null,null,null,null,null,null,null,null,null,null,null,"manufacturer"]
[null,null,{"$f":"'A-Basic Info. '!C5","v":0},null,null,null,null,null,null,null,1,"Quality Management",null,null,null,null,"Score","Max",null,null,null,null,null,null,null,"MANUFACTURER"]
[null,null,{"$f":"'A-Basic Info. '!C6","v":0},null,null,null,null,null,null,null,null,null,"1) Quality Management System",null,null,null,{"$f":"'B-Quality Management 1'!G4","v":0},{"$f":"'B-Quality Management 1'!I4","v":5},null,null,null,null,null,null,null,"CONTRACTOR"]
["Participant: ",null,{"$f":"'A-Basic Info. '!C9","v":0},null,null,null,"E-mail: ",{"$f":"'A-Basic Info. '!H10","v":0},null,null,null,null,"2) Leadership",null,null,null,{"$f":"'B-Quality Management 1'!G21","v":0},{"$f":"'B-Quality Management 1'!I21","v":6},null,null,null,null,null,null,null,"SERVICE SUPPLIER"]
[null,null,{"$f":"'A-Basic Info. '!C10","v":0},null,null,null,null,null,null,null,null,null,"3) Planning",null,null,null,{"$f":"'C-Quality Management 2'!G4","v":0},{"$f":"'C-Quality Management 2'!I4","v":3},null,null,null,null,null,null,null,"DISTRIBUTOR"]
[null,null,null,null,null,null,null,null,null,null,null,null,"4) Resources",null,null,null,{"$f":"'C-Quality Management 2'!G15","v":0},{"$f":"'C-Quality Management 2'!I15","v":8}]
["Category",null,null,null,null,null,"Max Score","Earned Score",null,null,null,null,"5) Operations",null,null,null,{"$f":"'D-Quality Management 3'!G4","v":0},{"$f":"'D-Quality Management 3'!I4","v":12}]
{"$rows_left_out":69}
{"sheet":"Draft","index":4,"n_rows":5,"n_cols":5,"rows_kept":5,"cut":false,"hidden":true,"merged":[]}
[]
[null,"choose"]
[null,0,null,0,0]
[null,0.5,null,1,1]
[null,1,null,null,"N/A"]

{"sheet":"A-Basic Info. ","index":5,"n_rows":56,"n_cols":7,"rows_kept":56,"cut":false,"hidden":false,"merged":[[26,6,26,9],[29,2,29,4],[31,2,31,4],[24,7,24,9],[27,1,28,9],[29,5,29,9],[30,5,30,9],[31,5,31,9],[25,6,25,9],[25,4,25,5],[26,4,26,5],[30,2,30,4],[69,7,69,9],[32,2,32,4],[34,1,34,4],[42,1,46,9],[38,1,38,4],[55,6,55,9],[36,1,36,4],[32,5,32,9],[33,5,33,9],[34,5,34,9],[36,5,36,9],[38,5,38,9],[61,7,61,9],[33,2,33,4],[39,1,39,4],[0,1,1,9],[3,2,3,9],[5,2,5,9],[10,2,10,5],[6,2,6,9],[4,2,4,9],[7,2,7,9],[9,2,9,5],[9,7,9,9],[10,7,10,9],[18,7,18,9],[13,2,13,5],[16,7,16,9],[17,2,17,5],[16,2,16,5],[15,2,15,5],[15,7,15,9],[13,7,13,9],[14,2,14,5],[14,7,14,9],[19,1,20,9],[2,2,2,9],[21,6,21,9],[22,6,22,9],[23,6,23,9],[8,2,8,5],[11,2,11,5],[8,7,8,9],[11,7,11,9],[12,7,12,9],[12,2,12,5],[21,4,21,5],[22,4,22,5],[23,4,23,5],[18,2,18,5],[17,7,17,9]]}
[null,"EnerSys Supplier/Contractor Quality Evaluation"]
[]
[null,"Supplier Name:"]
[null,"Address 1:"]
[null,"Address 2:"]
[null,"City, Post Code:"]
[null,"Product(s):"]
[null,"Website:"]
[null,"Completed By:",null,null,null,null,"Date:"]
[null,"Title:",null,null,null,null,"E-mail:"]
{"$rows_left_out":47}
{"sheet":"B-Quality Management 1","index":6,"n_rows":44,"n_cols":13,"rows_kept":44,"cut":false,"hidden":false,"merged":[[27,13,27,19],[0,0,0,10],[1,0,1,3],[3,1,3,3],[5,2,5,8],[7,2,8,8],[11,2,11,8],[43,7,43,10],[14,2,14,8],[17,2,19,8],[20,1,20,2],[22,2,22,8],[25,2,26,8],[28,2,29,8],[31,2,32,8],[34,2,35,8],[37,2,38,8],[41,5,41,6]]}
["Evaluation Work Sheet: Supplier Assessment"]
["Quality Management",null,null,null,null,null,null,null,null,null,null,null,"Comments/Remarks"]
[]
["1)","Quality Management System",null,null,null,"Score ",{"$f":"SUM(J6,J9,J12,J15,J18)","v":0},"out of ",{"$f":"SUM(K6:K18)","v":5},null,"Max"]
[]
[null,null,"A) Organization have a quality management system",null,null,null,null,null,null,0,1,"→"]
[]
[null,null,"B) Does the organization monitor and review external and internal issues"]
[null,null,null,null,null,null,null,null,null,0,1,"→"]
[]
{"$rows_left_out":35}
{"sheet":"C-Quality Management 2","index":7,"n_rows":44,"n_cols":13,"rows_kept":44,"cut":false,"hidden":false,"merged":[[30,2,30,8],[0,0,0,10],[3,1,3,2],[5,2,6,8],[8,2,9,8],[11,2,12,8],[14,1,14,2],[16,2,17,8],[19,2,21,8],[23,2,24,8],[26,2,27,8],[29,2,29,8],[32,2,33,8],[35,2,36,8],[38,2,39,8],[41,5,41,6],[43,7,43,10]]}
["Evaluation Work Sheet: Supplier Assessment"]
["Quality Management",null,null,null,null,null,null,null,null,null,null,null,"Comments/Remarks"]
[]
["3)","Planning",null,null,null,"Score ",{"$f":"J6+J9+J12","v":0},"out of ",{"$f":"SUM(K6:K13)","v":3},null,"Max"]
[]
[null,null,"A) Are the risks and opportunities addressed in the Quality management system",null,null,null,null,null,null,0,1,"→"]
[]
[]
[null,null,"B) Does the organization maintain documented information on the quality objectives",null,null,null,null,null,null,0,1,"→"]
[]
{"$rows_left_out":35}
{"sheet":"D-Quality Management 3","index":8,"n_rows":68,"n_cols":13,"rows_kept":68,"cut":false,"hidden":false,"merged":[[10,2,11,8],[0,0,0,10],[1,0,1,3],[3,1,3,2],[5,2,6,8],[8,2,8,8],[44,2,45,8],[13,2,13,8],[15,2,16,8],[18,2,19,8],[21,2,22,8],[24,2,25,8],[27,2,28,8],[30,2,31,8],[33,2,34,8],[36,2,37,8],[39,1,39,3],[41,2,42,8],[62,2,62,8],[65,5,65,6],[67,7,67,10],[47,2,48,8],[50,2,51,8],[55,1,55,4],[57,2,57,8],[59,2,60,8],[61,2,61,8]]}
["Evaluation Work Sheet: Supplier Assessment"]
["Quality Management",null,null,null,null,null,null,null,null,null,null,null,"Comments/Remarks"]
[]
["5)","Operation",null,null,null,"Score ",{"$f":"J6+J9+J11+J14+J16+J19+J22+J25+J28+J31+J34+J37","v":0},"out of ",{"$f":"SUM(K6:K37)","v":12},null,"Max"]
[]
[null,null,"A) Does the organization determine the reequipments, criteria, resources needed to achieve conformity for the products and services.",null,null,null,null,null,null,0,1,"→"]
[]
[]
[null,null,"B) Does the organization use DFMEA and PFMEA to determine risk mitigation.",null,null,null,null,null,null,0,1,"→"]
[]
{"$rows_left_out":59}
{"sheet":"E-Customer Service 1","index":9,"n_rows":30,"n_cols":13,"rows_kept":30,"cut":false,"hidden":false,"merged":[[29,7,29,10],[27,5,27,6],[24,2,24,8],[19,1,19,2],[21,2,21,8],[23,2,23,8],[14,1,14,2],[16,2,16,8],[0,0,0,10],[5,2,5,8],[8,2,8,8],[10,2,10,8],[3,1,3,2],[1,0,1,2],[6,2,6,8],[12,2,12,8]]}
["Evaluation Work Sheet: Supplier Assessment"]
["Customer Service",null,null,null,null,null,null,null,null,null,null,null,"Comments/Remarks"]
[]
["1)","Customer Service ",null,null,null,"Score ",{"$f":"J6+J9+J11+J13","v":0},"out of ",{"$f":"SUM(K5:K13)","v":4},null,"Max"]
[]
[null,null,"A) Is customer support guaranteed? ",null,null,null,null,null,null,0,1,"→"]
[null,null,"If answer is \"1\" please explain how. Include customer service hours."]
[]
[null,null,"B) Are there routine customer surveys/feedback to measure customer satisfaction? ",null,null,null,null,null,null,0,1,"→"]
[]
{"$rows_left_out":21}
{"sheet":"F-Customer Service 2","index":10,"n_rows":23,"n_cols":13,"rows_kept":23,"cut":false,"hidden":false,"merged":[[0,0,0,10],[8,1,8,3],[9,2,9,8],[5,2,5,8],[1,0,1,2],[14,2,14,8],[18,2,18,8],[22,7,22,10],[20,5,20,6],[11,2,12,8]]}
["Evaluation Work Sheet: Supplier Assessment"]
["Customer Service",null,null,null,null,null,null,null,null,null,null,null,"Comments/Remarks"]
[]
["4)","Delivery",null,null,null,"Score ",{"$f":"J6","v":0},"out of ",{"$f":"SUM(K5:K7)","v":1},null,"Max"]
[]
[null,null,"A) Do you have? a system to acknowledge Purchase Orders? i.e. Electronic Data Interchange (EDI)",null,null,null,null,null,null,0,1,"→"]
[]
[]
["5)","Customer Support Systems",null,null,null,"Score",{"$f":"J12+J15","v":0},"out of ",{"$f":"SUM(K10:K40)","v":2},null,"Max"]
[]
{"$rows_left_out":14}
{"sheet":"G-Human Resources","index":11,"n_rows":23,"n_cols":13,"rows_kept":23,"cut":false,"hidden":false,"merged":[[15,2,15,8],[22,7,22,10],[20,5,20,6],[16,2,16,8],[18,2,18,8],[17,2,17,8],[0,0,0,10],[1,0,1,1],[9,2,10,8],[13,2,13,8],[11,2,11,8],[5,2,5,8],[7,2,7,8]]}
["Evaluation Work Sheet: Supplier Assessment"]
["Human Resources",null,null,null,null,null,null,null,null,null,null,null,"Comments/Remarks"]
[]
["1)","General",null,null,null,"Score ",{"$f":"J6+J8+J10+J12+J14+J16+J18","v":0},"out of ",{"$f":"SUM(K5:K25)","v":7},null,"Max"]
[]
[null,null,"A) Are job descriptions developed specifying required competence? ",null,null,null,null,null,null,0,1,"→"]
[]
[null,null,"B) Does a comprehensive employee training program exist?",null,null,null,null,null,null,0,1,"→"]
[]
[null,null,"C) Is there an evaluation of the effectiveness of training?",null,null,null,null,null,null,0,1,"→"]
{"$rows_left_out":14}
{"sheet":"H-Environmental","index":12,"n_rows":38,"n_cols":31,"rows_kept":38,"cut":false,"hidden":false,"merged":[[0,0,0,10],[5,2,5,8],[8,2,8,8],[11,2,11,8],[12,2,12,8],[9,2,9,8],[1,0,1,2],[26,2,26,8],[31,2,31,8],[6,2,6,8],[15,2,15,8],[35,5,35,6],[28,2,29,8],[24,2,24,8],[33,2,33,8],[14,2,14,8],[17,2,17,8],[23,2,23,8],[20,2,20,8],[21,2,21,8],[18,2,18,8]]}
["Evaluation Work Sheet: Supplier Assessment"]
["Environmental",null,null,null,null,null,null,null,null,null,null,null,"Comments/Remarks"]
[]
["1)","Environmental",null,null,null,"Score ",{"$f":"J6+J9+J12+J15+J18+J21+J24+J27+J29+J32+J34","v":0},"out of ",{"$f":"SUM(K6:K34)","v":11},null,"Max",null,null,null,null,null,null,null,null,null,null,null,null,null,null,null,null,null,null,0,5]
[]
[null,null,"A) Does the facility have an Environmental Management System (EMS) in place? E.g. ISO14001 or EMAS.",null,null,null,null,null,null,0,1,"→",null,null,null,null,null,null,null,null,null,null,null,null,null,null,null,null,null,{"$f":"J6","v":0}]
[null,null,"(If yes, please provide a copy of your up to date accreditation certificate)",null,null,null,null,null,null,null,null,null,null,null,null,null,null,null,null,null,null,null,null,null,null,null,null,null,null,{"$f":"IF(J6>AD4,AE4,0)","v":0}]
[]
[null,null,"B) Does the Company have an environmental and/or sustainability policy? ",null,null,null,null,null,null,0,1,"→",null,null,null,null,null,null,null,null,null,null,null,null,null,null,null,null,null,{"$f":"J9","v":0}]
[null,null,"(If yes, please provide a copy.)"]
{"$rows_left_out":29}
{"sheet":"I-Health & Safety","index":13,"n_rows":48,"n_cols":13,"rows_kept":48,"cut":false,"hidden":false,"merged":[[25,2,26,8],[0,0,0,10],[1,0,1,2],[5,2,5,8],[7,2,7,8],[10,2,10,8],[8,2,8,8],[11,2,11,8],[19,2,19,8],[23,2,23,8],[18,2,18,8],[21,2,22,8],[13,2,13,8],[15,2,16,8],[47,7,47,10],[29,2,30,8],[27,2,27,8],[32,2,33,8],[37,2,38,8],[45,5,45,6],[35,2,36,8],[42,2,43,8],[40,2,40,8]]}
["Evaluation Work Sheet: Supplier Assessment"]
["Health & Safety",null,null,null,null,null,null,null,null,null,null,null,"Comments/Remarks"]
[null,null,null,null,null,null,null,null,null,null,"Max"]
["1)","Health & Safety",null,null,null,"Score ",{"$f":"J6+J8+J11+J14+J16+J19+J22+J26+J30+J33+J36+J38+J41+J43","v":0},"out of ",{"$f":"SUM(K6:K43)","v":14}]
[]
[null,null,"A) Does the facility have a Health & Safety management system in place? ",null,null,null,null,null,null,0,1,"→"]
[]
[null,null,"B) Is this certified?",null,null,null,null,null,null,0,1,"→"]
[null,null,"     (Please provide a copy)"]
[]
{"$rows_left_out":39}
{"sheet":"J-Regulatory Compliance","index":14,"n_rows":42,"n_cols":13,"rows_kept":42,"cut":false,"hidden":false,"merged":[[33,2,36,8],[7,2,7,8],[30,2,31,8],[16,2,17,8],[10,2,10,8],[14,2,14,8],[28,2,28,8],[41,7,41,10],[0,0,0,10],[1,0,1,10],[26,2,26,8],[39,5,39,6],[19,2,21,8],[6,2,6,8],[5,2,5,8],[9,2,9,8],[13,2,13,8],[11,2,11,8],[22,2,22,8],[18,2,18,8]]}
["Evaluation Work Sheet: Supplier Assessment"]
["Regulatory Compliance",null,null,null,null,null,null,null,null,null,null,null,"Comments/Remarks"]
[]
["1)","REACH & ROHS",null,null,null,"Score ",{"$f":"J6+J10+J14+J17","v":0},"out of",{"$f":"SUM(K5:K17)","v":4},null,"Max"]
[]
[null,null,"A) Is your company REACH compliant?",null,null,null,null,null,null,0,1,"→"]
[null,null,"(If yes, 1 point, if no 0.)"]
[null,null,"(If yes, please provide a copy of certification.)"]
[]
[null,null,"B) Is your company ROHS compliant?",null,null,null,null,null,null,0,1,"→"]
{"$rows_left_out":33}
{"sheet":"Arkusz1","index":15,"n_rows":15,"n_cols":4,"rows_kept":15,"cut":false,"hidden":true,"merged":[[2,5,2,6],[7,5,7,6]]}
[]
[null,"answer",null,"answers"]
[null,"yes",null,"yes"]
[null,"no",null,"no"]
[null,null,null,"unknown"]
[]
[]
[]
[null,"information"]
[null,"Yes, 100% "]
{"$rows_left_out":6}
{"sheet":"K-Procurement","index":16,"n_rows":59,"n_cols":13,"rows_kept":59,"cut":false,"hidden":false,"merged":[[0,0,0,10],[1,0,1,2],[5,2,5,8],[7,2,8,8],[3,1,3,3],[10,2,10,8],[27,2,27,8],[42,1,42,4],[14,2,14,8],[18,2,19,8],[16,2,16,8],[12,1,12,3],[24,2,25,8],[36,2,37,8],[21,2,22,8],[33,2,34,8],[33,13,33,19],[39,2,40,8],[29,2,29,8],[31,2,31,8],[56,5,56,6],[48,2,49,8],[54,2,54,8],[51,2,52,8],[44,2,46,8]]}
["Evaluation Work Sheet: Supplier Assessment"]
["Procurement",null,null,null,null,null,null,null,null,null,null,null,"Comments/Remarks"]
[]
["1)","Material Management",null,null,null,"Score ",{"$f":"J6+J8+J11","v":0},"out of ",{"$f":"SUM(K6:K11)","v":3},null,"Max"]
[]
[null,null,"A) Integrated Material Requirement Planning (MRP) system in place.",null,null,null,null,null,null,0,1,"→"]
[]
[null,null,"B) Tracking of inventory turns, supplier On-time Delivery (OTD) and supplier defects.",null,null,null,null,null,null,0,1,"→"]
[]
[]
{"$rows_left_out":50}
{"sheet":"L-Engineering","index":17,"n_rows":36,"n_cols":13,"rows_kept":36,"cut":false,"hidden":false,"merged":[[17,2,18,8],[24,2,25,8],[27,2,28,8],[35,7,35,10],[33,5,33,6],[22,2,22,8],[20,2,21,8],[13,1,13,3],[15,2,15,8],[0,0,0,10],[1,0,1,2],[5,2,5,8],[3,1,3,2],[7,2,8,8],[10,2,11,8]]}
["Evaluation Work Sheet: Supplier Assessment"]
["Engineering",null,null,null,null,null,null,null,null,null,null,null,"Comments/Remarks"]
[]
["1)","Tooling",null,null,null,"Score ",{"$f":"J6+J8+J11","v":0},"out of ",{"$f":"SUM(K6:K11)","v":3},null,"Max"]
[]
[null,null,"A) Does your company have in-house machine shop capabilities?",null,null,null,null,null,null,0,1,"→"]
[]
[null,null,"B) Does your company have in-house tool/mold maintenance and repair capabilities?",null,null,null,null,null,null,0,1,"→"]
[]
[]
{"$rows_left_out":27}
{"sheet":"M-Distributor","index":18,"n_rows":58,"n_cols":13,"rows_kept":58,"cut":false,"hidden":false,"merged":[[57,5,57,6],[29,2,29,8],[31,2,31,8],[37,2,38,8],[40,2,41,8],[43,2,44,8],[33,2,35,8],[55,2,55,8],[46,2,47,8],[49,2,50,8],[52,2,54,8],[23,2,24,8],[26,2,27,8],[0,0,0,10],[1,0,1,2],[3,1,3,4],[5,2,6,8],[8,2,9,8],[11,2,12,8],[14,2,15,8],[17,2,18,8],[22,2,22,8],[20,2,21,8]]}
["Evaluation Work Sheet: Supplier Assessment"]
["Distributor",null,null,null,null,null,null,null,null,null,null,null,"Comments/Remarks"]
[]
["1)","Your Company",null,null,null,"Score ",{"$f":"J6+J9+J12+J15+J18+J21+J24+J27+J30+J32+J34+J38+J41+J44+J47+J50+J53+J56","v":0},"out of ",{"$f":"SUM(K6:K56)","v":18},null,"Max"]
[]
[null,null,"A) Are premises well constructed and visibly good condition and well ventilated?  Is there an effective pest control program in place?",null,null,null,null,null,null,0,1,"→"]
[]
[]
[null,null,"B) Has the site implemented security measures to control access of unauthorized persons?  ",null,null,null,null,null,null,0,1,"→"]
[]
{"$rows_left_out":49}
{"sheet":"N-Generic, Business","index":19,"n_rows":36,"n_cols":21,"rows_kept":36,"cut":false,"hidden":false,"merged":[[0,0,0,7],[2,1,2,5],[2,6,3,6]]}
["Summary of the Documents Required\n EnerSys Supplier/Contractor Quality Survey"]
[null,null,null,null,null,null,null,null,null,null,null,null,null,null,null,null,null,null,null,1,0]
[null,"Copies of the following documents should be returned with this spreadsheet. ",null,null,null,null,"Please enter 1 in box if document is attached "]
[null,"Electronic files (jpeg, pdf etc.) or photocopies please"]
[1,"Generic Requirements ","Score ",{"$f":"SUM(G7:G19)","v":0},"out of",{"$f":"COUNTIFS(G7:G19,T2)+COUNTIFS(G7:G19,U2)","v":7}]
[]
["A","Current ISO 9001 certification",null,null,null,null,0]
[null,null,null,null,null,null,null,{"$f":"IF(G8,Scoring_Summary!G12,0)","v":0}]
["B","Current ISO 14001 certification",null,null,null,null,0]
[]
{"$rows_left_out":27}
{"sheet":"O-Special Process Documentation","index":20,"n_rows":25,"n_cols":4,"rows_kept":25,"cut":false,"hidden":false,"merged":[[0,0,0,4],[2,2,4,2]]}
["Specific Process Requirements"]
[]
[null,"Copies of the following documents should be returned with this spreadsheet. ","Please enter 1 in box if document is attached "]
[null,"Electronic files (jpeg, pdf etc.) or photocopies please"]
[]
[]
[1,"Heat Layered Audit (i.e. CQI-9)",0]
[null,null,null,{"$f":"IF(C8,Scoring_Summary!G12,0)","v":0}]
[2,"Plating System Assessment (i.e. CQI-11)",0]
[]
{"$rows_left_out":16}
{"sheet":"P-Other Documents","index":21,"n_rows":45,"n_cols":4,"rows_kept":45,"cut":false,"hidden":false,"merged":[[0,0,0,4],[8,1,9,1],[2,2,4,2]]}
["Other Documents"]
[]
[null,"Copies of the following documents should be returned with this spreadsheet. ","Please enter 1 in box if document is attached "]
[null,"Electronic files (jpeg, pdf etc.) or photocopies please"]
[]
[]
[1,"Quality Core Tools Implementation (SPC, FMEA, MSA, APQP)",0]
[null,null,null,{"$f":"IF(C8,Scoring_Summary!G12,0)","v":0}]
[2,"Advanced Product Quality Planning (APQP) & Production Part Approval Process (PPAP)",0]
[]
{"$rows_left_out":36}
{"sheet":"Q-Contractor","index":22,"n_rows":56,"n_cols":13,"rows_kept":56,"cut":false,"hidden":false,"merged":[[41,7,41,10],[0,0,0,10],[1,0,1,2],[8,2,8,8],[13,2,13,8],[3,1,3,4],[28,2,28,8],[10,2,11,8],[15,2,16,8],[18,2,19,8],[26,2,26,8],[36,2,37,8],[20,2,20,8],[34,2,34,8],[23,2,23,8],[32,2,33,8],[5,2,6,8],[30,2,30,8],[24,2,24,8],[21,1,21,4],[39,5,39,6]]}
["Evaluation Work Sheet: Supplier Assessment - Site Responsibility"]
["Contractor",null,null,null,null,null,null,null,null,null,null,null,"Comments/Remarks"]
[]
["1)","Working with Hazardous Materials",null,null,null,"Score ",{"$f":"J6+J9+J11+J14+J16+J19","v":0},"out of ",{"$f":"SUM(K6:K19)","v":6},null,"Max"]
[]
[null,null,"A) Does your company have familiarity at Enersys site layout and precautions required?",null,null,null,null,null,null,0,1,"→"]
[]
[]
[null,null,"B) Does your company have experience of working with Lead?",null,null,null,null,null,null,0,1,"→"]
[]
{"$rows_left_out":47}
{"sheet":"R-Service","index":23,"n_rows":45,"n_cols":13,"rows_kept":45,"cut":false,"hidden":false,"merged":[[44,7,44,10],[32,2,33,8],[28,2,28,8],[30,2,30,8],[13,2,13,8],[36,2,36,8],[38,2,39,8],[24,2,24,8],[34,2,34,8],[42,5,42,6],[10,2,11,8],[15,2,16,8],[18,2,19,8],[26,2,27,8],[20,2,20,8],[21,1,21,4],[23,2,23,8],[0,0,0,10],[1,0,1,2],[3,1,3,4],[5,2,6,8],[8,2,8,8]]}
["Evaluation Work Sheet: Supplier Assessment -Site Responsibility"]
["SERVICE",null,null,null,null,null,null,null,null,null,null,null,"Comments/Remarks"]
[]
["1)","Working with Hazardous Materials",null,null,null,"Score ",{"$f":"J6+J9+J11+J14+J16+J19","v":0},"out of ",{"$f":"SUM(K6:K19)","v":6},null,"Max"]
[]
[null,null,"A) Does your company have familiarity at Enersys site layout and precautions required?",null,null,null,null,null,null,0,1,"→"]
[]
[]
[null,null,"B) Does your company have experience of working with Lead?",null,null,null,null,null,null,0,1,"→"]
[]
{"$rows_left_out":35}